An Exception Runtime Error Has Occurred In Script Vista

Help

RECOMMENDED: If you have Windows errors then we strongly recommend that you download and run this (Windows) Repair Tool.

Ora 00604 Error Occurred At Recursive Sql Level 1 ERROR at line 1: ORA-00604: error occurred at recursive SQL level 1 ORA-06502: PL/SQL: numeric or value error: character string buffer too small ORA-06512: at line 6. ORA-01031 insufficient privileges – Informatica KB Search – Apr 4, 2014. ERROR: "ORA-01031 insufficient privileges" when PowerCenter sessions fail during. ORA-00604: error occurred at recursive SQL level 1
Xfs_log_force Error 5 Returned Iscsi Is this a sign of dying hard drive? up vote 5 down vote favorite. Jul 4 20:28:06 host-37 kernel: [413674.809659] XFS (sdf1): xfs_log_force: error 5 returned. kernel panic rebooting server with iSCSI partition mounted Status:. [ 155.747712] XFS (dm-3): xfs_log_force: error 5 returned. [ 185.817059] XFS (dm-3):. Bug #1706132 “xfs slab objects (memory) leak when

This application can be used on Microsoft Vista. English (US) language resources for the Kerberos. the server that the libraries contact when synchronizing the time is time. The domain name has been left off on purpose. If local system.

If any unhandled exceptions occur, to (optionally) prevent restarting and end in a possible endless exception cycle. Single application instance management.

Nov 11, 2010  · [An Exception "Runtime error" has occurred in Script] Below this there is a box that says: "Possible Debuggers" "New Instance of Microsoft Script Editor.". When I then click on "Debug" I get a message that says: "Microsoft VBscript runtime error: Object required WScript.

Jan 23, 2011  · MICROSOFT VISUAL STUDIO DEBUGGER (AN EXCEPTION OCCURRED). microsoft-visual-studio-debugger-an-exception. Run Time Error" has occurred in script.

May 15, 2009  · Runtime error, unable to debug. An exception ‘Runtime Error’ has occurred in Script. However, My operating system is Windows Vista.

How do I stop the Adobe Reader Installer from crashing?. An exception ‘Runtime Error’ has occurred in Script. Content tagged with window_vista

How To Calculate Standard Error For T Test In statistics, the t-statistic is the ratio of the departure of the estimated value of a parameter from. However, when t-statistic is needed to test the hypothesis of the form H0: β = β0, then a non-zero β0 may be used. If β ^ {displaystyle scriptstyle. How to perform a simple t-test in Microsoft Excel.

. Exception address is 00413E6C – Error message: "An exception "Runtime error" has occurred in script.". Is Vista Service Pack 1.

Jun 11, 2008. Got this error: Microsoft JScript runtime error: Object doesn't support this property or method. with prototype.js. An error has occurred in the script on this page:. I have a Windows Vista and Internet Explorer 10. You cannot use reserved words other wise it will throw exceptions like the one you got above.

. an exception "runtime error" has occurred in script. Uncheck the box for "Display a notification about every script error" 5. Windows / Windows Vista.

. "An Exception 'Runtime Error' Has Occurred. Runtime Error' has occurred in script. However no debuggers are registered that can debug this exception.

A very ordinary script casts a pall over. the seductions of a wide-screen vista. There are also side trips to London and Antwerp for a fleeting glimpse of the diplomatic intrigues surrounding the international diamond trade. Zwick does not.

Code Error 800A0046 – Runtime error: Permission Denied VBScript – Examples of runtime error code 800A0046 – Permission denied. The secret is to read the Windows Script Error message carefully, then check the access control list to see who has permission to use the page, or use the device. I think what happened was there were multiple simultaneous attempts to open that file.

. an exception "runtime error" has occurred in script. Uncheck the box for "Display a notification about every script error" 5. Windows / Windows Vista.

Sep 18, 2008. Hence the need for error messages, which have been around nearly as. system that became Windows Vista–crashed with a full-screen error.

If you still can't work out what happened, have a look at the errors below to see if yours is. Exception: RuntimeError Message: Script Error within event 9, map 38 (Lab):. It is caused when the user has deleted a map from the game, but has not. With Windows Vista users, this error may occur: Failed to obtain a trial serial.

For more information, see Specifying a Run-Time Location for a Specific. InstallScript objects have been deprecated in favor of InstallShield prerequisites. any InstallShield prerequisites, and the.msi file) on Windows Vista and later platforms. This build error occurs when an exception error has occurred with a COM+.

MICROSOFT VISUAL STUDIO DEBUGGER (AN EXCEPTION OCCURRED). I am running Vista Home Premium. An exception "Run Time Error" has occurred in script.

Runtime Error Quattro Pro X3. [An Exception “Runtime error” has occurred in Script]. runtime error – Vista Support Forums – I installed WordPerfect.

LabVIEW does not support this device driver on Windows Vista or later. −4824, Clipped. A buffer underflow has occurred because the application is not writing data quickly enough. This error can occur if you use a VI that is not supported in the LabVIEW Run-Time Engine. 1089, Error occurred while executing script.

This avoids any errors associated with working with an object that has not been instantiated or a call to a method that does not exist. Listing A checks for objects used (variables and fields) before using them. The script. exception, like a.

RECOMMENDED: Click here to fix Windows errors and improve system performance