Error C1075 Visual Studio

Help

RECOMMENDED: If you have Windows errors then we strongly recommend that you download and run this (Windows) Repair Tool.

Error Message; Fatal Error C999: UNKNOWN MESSAGE Please choose the Technical Support command on the Visual C++ Help menu, or.

c++ – error C1075 when using Opencv_2.4.9 with Visual Studio. – After linking libraries from openpc 2.4.9 with visual studio 2010, I build and ran a program and got this error message. error C1075: end of file found before the.

Also installed Microsoft Visual Studio 2008 Express after receiving. mod_auth_cas.c(1075) : error C2065: 'LOCK_EX' : undeclared identifier

I’m writing a small program in C++. When I try to compile it using MS VS 2013 Compiler I get an error: "C2601: ‘main’ : local function definitions are illegall". What.

Get Great Deals on Visual Studio. Download Now At The Official Microsoft® Store.

2>c:Program Files (x86)Microsoft Visual Studio 10.0VCincludeexcpt.h(40): fatal error C1075: end of file found before the left brace '{' at.

could someone also tell me if the actions i am attempting to do which are stated in the comments are correct or not. i am new at c++ and i think its correct but i.

Error: C1075 the left brace '{' was unmatched at the end of the file. 5 comments; share. is C++ not Visual Basic. Are you using Visual Studio?

fatal error C1075:左側中カッコ'{'に対応するものが. コード編集に使っているエディタ ではなく,VisualStudioのコードエディタでみると,1つカッコの数が.

srcaddrman.cpp(528): fatal error C1075: конец файла обнаружен ранее, / 2014/06/11/c-11-14-feature-tables-for-visual-studio-14-ctp1.aspx

Hi, I'm new here and new to programming. I'm Getting an error Error 1 error C1075: end of file found before the left brace '{' at 'c:\documents\visual studio 2012.

Fatal Error C1075 (C++) – msdn.microsoft.com – Fatal Error C1075. Visual Studio 2005 Other Versions Visual Studio 2015 ; Visual Studio 2013 ; Visual Studio 2012; Visual Studio 2010; Visual Studio 2008; View.

C. Caba, Irene see Alba, Irene Caba. Caba, Irene Gutierrez – (1929 – 1995) Spanish film and television actress Irene Caba was born (April 25, 1929) in Madrid into.

Gcc Error Variably Modified At File Scope MESSAGES Most error messages have an associated error number. file plus any text within any #include file(s). parameter A formal parameter of a. 5 Too many #endif's — A #endif was encountered not in the scope of a #if or #ifdef or # ifndef. 43 Vacuous type for variable 'Symbol' — A vacuous type was

. visual studio 9.0vcincludemath.h(29) : error C2059: syntax error : 'string. 1> d:baitapbài thibài thimainphanso.cpp(18) : fatal error C1075:.

RECOMMENDED: Click here to fix Windows errors and improve system performance