Error While Executing Forked Tests Maven

Help

RECOMMENDED: If you have Windows errors then we strongly recommend that you download and run this (Windows) Repair Tool.

maven – Error while running testng.XML from Pom.xml – Stack Overflow – Jun 2, 2016. Hi I got the solution by adding below dependency: <dependency> <groupId>org. apache.maven.surefire</groupId>.

Error Reading Data Segment File There are many reasons why Error Reading Data Segment File happen, including having malware, spyware, or programs not installing properly. You can have all kinds of. Pdf Error 135 FAIRBANKS – Today’s rainfall is expected to turn to snow overnight in the higher elevations around Fairbanks, according to the National Weather Service. The summits above

Microsoft has dropped its three-month-long pursuit of Yahoo, ending a historic acquisition attempt whose failure takes. “Yahoo is profitable, growing, and executing well on its strategic plan to capture the large opportunities in the.

A curated list of awesome Go frameworks, libraries and software

Aug 18, 2010. [INFO] Error while executing forked tests.; nested exception is org.apache.maven. surefire.booter.shade.org.codehaus.plexus.util.cli.

Configuration Global Settings. In the Configure System page, the Git Plugin provides the following options. Global Config user.name Value: if provided git config user.

Error Code 0x800ccc0f In Windows Mail Windows Live Mail Error ID: 0x800CCC0F. In particular a large number of the DSL routers were never updated to automatically allow the. SmartPCFixer™ is a fully featured and easy-to-use system optimization suite. With it, you can clean windows registry, remove cache files, fix errors, defrag disk. (Figure 1: Outlook Express Error Window Example). The important.

TestNGException while executing mavenized selenium. test failed: There was an error in the forked. Since you are running your tests using Maven hence surefire.

Error while executing forked tests.; nested exception is org.apache.maven.surefire.booter.shade.org.codehaus.plexus.util.cli.CommandLineException: Error whi le.

maven – TestNGException while executing mavenized selenium. – Oct 27, 2014. Make sure you have fork mode set to never in your pom.xml for surefire plugin configuration. [ERROR] Failed to execute goal org.apache.maven.plugins: maven-surefire-plugin:2.19:test (default-test) on project MoneyFlow:.

Feb 22, 2011. We want to upgrade from our current 2.5 version of the maven-surefire-plugin to something newer but cannot get past the error below. We've.

Sql Error 8998 Error Code 0x800ccc0f In Windows Mail Windows Live Mail Error ID: 0x800CCC0F. In particular a large number of the DSL routers were never updated to automatically allow the. SmartPCFixer™ is a fully featured and easy-to-use system optimization suite. With it, you can clean windows registry, remove cache files, fix errors, defrag disk. (Figure 1: Outlook

Jenkins is an open source continuous integration tool written in Java. The project was forked from Hudson after a dispute with Oracle. Jenkins provides continuous.

maven surefire Error while executing forked tests.; nested exception is java.lang.IllegalStateException: testSetStarting called. We have the same Maven setup as S.

Search metadata Search full text of books Search TV captions Search archived web sites Advanced Search

If you’re writing a library, or an app, where do the unit test files go? It’s nice to separate the test files from the main app code, but it’s awkward to put them.

While the Jetty Maven Plugin can be very useful for development we do not recommend its use in a production capacity. In order for the plugin to work it needs to.

NodeJS took JavaScript to next level by providing a complete environment for executing JavaScript. us specify the exact datatype while declaring.

Nov 1, 2012. This error occurs if some unit test cases are failing. plugin:2.12.4:test failed: The forked VM terminated without saying properly goodbye.

"Yahoo is profitable, growing, and executing well on its strategic plan to capture the. at the time — Yahoo’s management began seeking and considering alternatives, while its stock began to rise from the latest pre-bid price of.

RECOMMENDED: Click here to fix Windows errors and improve system performance