Error X11/xlib.h

Help

RECOMMENDED: If you have Windows errors then we strongly recommend that you download and run this (Windows) Repair Tool.

Mar 14, 2011. You can add Xlib.h to your system by running the following. test.cpp:1:22: fatal error: X11/Xlib.h: No such file or directory compilation.

Modern Tk Tutorial for Tcl, Ruby, Python and Perl

Mar 20, 2013. Now, when I try to install tk again configure works fine as usual but I get the same error again while using make X11/Xlib.h: No such file or.

TkDocs – Tk Tutorial – Installing Tk – Installing Tk: Part of a Modern Tk Tutorial for Tcl, Ruby, Python and Perl

Hi, I am trying to compile the code. I am getting this following error. Am I missing any package? x86_screen.h:12:22: error: X11/Xlib.h: No such file

When I type 'make all' I get this error message: X11/Xlib.h: No such file or directory along with a short list of parse errors, undeclared variables,

test.cpp:1:22: fatal error: X11/Xlib.h: No such file or directory compilation terminated. you need to install X11 development libraries.

General information about these FAQ’s Why this FAQ? The FAQ tries to answer questions before they’re asked. This saves the trouble of.

I’m trying to write a rather trivial program using open gl on linux, but at a compile time it says: Compile thumb : egl <= cuberenderer.c In file included from.

Ibm Error Code Thinkpad Unfortunately, not all the keys got larger in the transition from the classic style keyboard on the ThinkPad T420 to the island-style unit on the ThinkPad T430. IBM Thinkpad BIOS Beep Codes. 2 short, Initialization error, Error code is displayed. 1 long, 1. Continuous, Power supply error, Replace the power supply. Mpicc Error Please note:

For the time being, this feature is not used when building the library./a.out: error while loading shared libraries: libstdc++.so.6: cannot open shared object file: No such file or directory /usr/libexec/ld-elf.so.1: Shared object "libstdc++.so.

fatal error: X11/Xlib.h – Fedora Forum – [SOLVED] include/xcursor.h:7:22: fatal error: X11/Xlib.h: No such file or directory F16 Development.

The X-Windows files are in "/usr/X11R6". If you do not have that directory, you do not have the X-Windows development package installed. For X-Windows, you use -I/usr.

Error Code 800a03ec When I try to set a longish worksheet name using ruby and win32ole with the following code: require "win32ole" excel = WIN32OLE.new(‘Excel.Application’) excel.Visible. Solved: Error -214682728​4 – Discussion Forums – National Instruments – The error you're getting (hex code 800A03EC) is a Microsoft Office generic error rather than a LabVIEW error. It's likely that something's

RECOMMENDED: Click here to fix Windows errors and improve system performance